ads

Affichage des articles dont le libellé est doesn't. Afficher tous les articles
Affichage des articles dont le libellé est doesn't. Afficher tous les articles

lundi 21 septembre 2015

Windows doesn't recognize device plugged into usb



I flashed a custom rom wicked s5 xperience to my phone... It works awesome. Problem is now when I plug into usb it will charge but says the last device plugged into usb has malfunctioned and is not recognized. I tried to uninstall drivers and re install but no go. Any ideas on a fix?



LED doesn't work since moving from CM12.1 to stock 5.1.1



Hi,
After some issues with CM, I moved to stock 5.1.1. I added xposed and gravitybox for my desired tweaks, and now everything works as I like it except the LED.
It's just dead. Nothing gets it to shine except when charging (so I know it's not a hardware issue).
I've tried with GravityBox's Ultimate Notification feature (I have the paid version), and also other apps like Light Flow, Light Manager, and LED Test, but nothing turns the light back on.

Any ideas? something else to try?

Thanks.



dimanche 20 septembre 2015

"samsung security policy update" doesn't appear - but I want to disable it



Hi,
I have a Galaxy S6 5.1.1 bought in Thailand. It is rooted.
I want to use AdBlock Plus but it doesn't block the ads.
I read in ABP's forum that in order to make it work I should disable "samsung security policy update".
However, this option doesn't appear where it should, and I see no option to do so.

Could anyone help??



HELP ME PLEASE!! Phone doesnt work at all, I'm so frustrated dont know what to do =(



Hello! I'm Nicolas, from Chile. And i own a Xiaomi Mi4 Since March2015.The thing goes like this, since May the screen had a fringe/bar where the touch sensor stopped working, this was NEVER a problem, because it was an area that we never use. But 2 days ago, i pressed the power button to turn on the screen and put my password, but the screen went mad and showed just fringes with lots of colors, then it barely showed the password screen, then colors again and etc, sometimes it worked fine for like 10 seconds, and it crashed again. The phone started working awfully slow, i mean, with like 4 seconds delay for EVERYTHING, i couldnt use it!!. Sometimes it worked just fine then the screen went mad again, with fringes and dots and black or blank screens. I never did hit the phone in the process, not any kick, nothing, the screen just stopped working, all black. The next day i changed the screen (because i thought there was a problem with the screen cause it was previously with an issue, and i thought the ultra laggy system was a problem with the screen or something, that the incredible lag/delay was because the screen). And the thing is when i changed the screen, a brand new one, the exact same thing happened, nothing works, it is alive because i can screencast the phone on my laptop, but it keeps running incredibly slow, it is too slow i cant even open whatsapp without waiting 2 minutes... I cant even put my password smoothly, because it is so laggy and delayed, that if i press the number "1" it shows up on the screen like 4 seconds later... And i mean it shows up << on the laptop screen>> (not to forget the brand new screen doesnt work neither)... So it is a problem with the processor? the ram? the adreno 330? what? Please i need help, i cant afford a new phone =(.

Plus info: Everything seems to be connected alright, i did the replacement myself watching lots of videos, and everything is simple and i think well done, the phone is still alive, but controlling it by the laptop, screen doesnt work, wifi doesnt work (its like there is no adapter anymore...), 3g signal doesnt work, it does not even recognize my phone company it says no service, I controled it by the laptop and now is playing music at full volume...

I didnt know where to post this, sorry if misplaced.

HELP ME PLEASE!! I would be so thankful! =(



samedi 19 septembre 2015

Stuck on bootloop, and odin doesn't seem to work...



Hey,

As the title says the phone is stuck in bootloop after I was playing around with knox and enabled "Knox active protection" (the phone is rooted with pingpong...)
Sooooo the phone restarted and is now stuck in the loop :crying:

I know I had the latest update installed 5.1.1 I think and I live in Sweden so i should have the international thingy, but I don't really know more than that unfortunately... Searched around and found this thread but i was a bit too late for that warning, so i tried to flash the phone with odin but i only receive this message/error...
G920FXXU2BOFJ_G920FTEF2BOF1_G920FXXU2BOFJ_HOME.tar .mp5 <-- The name of the file I tried.

So I don't really know how to fix this problem and i've searched for info about it but i can't find any... And it's my only phone so I really need to fix it :(



Slow motion stock camera doesn't work



I shot a short film today with the stock app. I selected slow motion and started filming. Afterwards I noticed the film wasn't going slow and no way to slow it down it the gallery.

What am I doing wrong?



Verstuurd vanaf mijn LG-H815 met Tapatalk



CWM RECOVERY doesn't work for me on Note 3 with Lollipop



I've used Odin 3.07 to flash n900t-cwm-recovery-6.0.4.4(1025) but it didn't pass. I'm tired now and I want to go to bed but it bugs me I don't have root.
On 4.2 I think it was easy but on 5.0 it won't work for me, now. I've scoured pages and pages, so for now I am kindly asking for some directions.



vendredi 18 septembre 2015

Gionee e7 mini doesn't starting up



Hi guys, please help me with this kind of problem. My phone is not starting/loading even to loading screen is not starting up (sorry, im beginner. I don't know what it is). Maybe I've bricked my phone :(. It all started when I root this and install recovery_gnE7.img and my IMEI 1 & 2 both gone. Then, I grant also some apps. Then, I unroot it and uninstall the superuser and framaroot. Then changed to other framaroot (compatible framaroot based on the blogspot). but rooting was not successful. So I tried to shut it down. Then my cellphone starts to encounter this problem. I also tried to hold the power 10 sec upto 25 sec. but didn't work. It keeps on rebooting not displaying the logo and turning off then rebooting and so on.

Please help me guys on this.. :( Your help/suggestion will be much appreciated.



jeudi 17 septembre 2015

CM12.1 Compilation Error (package doesn't exist)



Hey all,
I am trying to build CM12.1 from source for Samsung Galaxy Grand Duos i9082..
I've downloaded the source, set up device tree, kernel and the required compatibility patches (required for this device)
Steps I perform:
source build/envsetup.sh
add_lunch_combo cm_i9082-userdebug
lunch (and the select the device)
mka

It starts the building process but after some time I get the following error which I'm unable to resolve:

frameworks/testing/runner/src/main/java/android/support/test/internal/runner/intent/IntentMonitorImpl.java:21: error: package android.support.annotation does not exist
import android.support.annotation.NonNull;
^
frameworks/testing/runner/src/main/java/android/support/test/runner/MonitoringInstrumentation.java:21: error: cannot find symbol
import android.app.Fragment;
^
symbol: class Fragment
location: package android.app
frameworks/testing/runner/src/main/java/android/support/test/runner/MonitoringInstrumentation.java:32: error: package android.support.test.internal.runner.hidden does not exist
import android.support.test.internal.runner.hidden.Expose dInstrumentationApi;
^
frameworks/testing/runner/src/main/java/android/support/test/runner/MonitoringInstrumentation.java:83: error: cannot find symbol
public class MonitoringInstrumentation extends ExposedInstrumentationApi {
^
symbol: class ExposedInstrumentationApi
frameworks/testing/runner/src/main/java/android/support/test/runner/MonitoringInstrumentation.java:344: error: cannot find symbol
public ActivityResult execStartActivity(
^
symbol: class ActivityResult
location: class MonitoringInstrumentation
frameworks/testing/runner/src/main/java/android/support/test/runner/MonitoringInstrumentation.java:361: error: cannot find symbol
public ActivityResult execStartActivity(
^
symbol: class ActivityResult
location: class MonitoringInstrumentation
frameworks/testing/runner/src/main/java/android/support/test/runner/MonitoringInstrumentation.java:398: error: cannot find symbol
Context who, IBinder contextThread, IBinder token, Fragment target,
^
symbol: class Fragment
location: class MonitoringInstrumentation
frameworks/testing/runner/src/main/java/android/support/test/runner/MonitoringInstrumentation.java:397: error: cannot find symbol
public ActivityResult execStartActivity(
^
symbol: class ActivityResult
location: class MonitoringInstrumentation
frameworks/testing/runner/src/main/java/android/support/test/runner/MonitoringInstrumentation.java:423: error: cannot find symbol
private ActivityResult stubResultFor(Intent intent) {
^
symbol: class ActivityResult
location: class MonitoringInstrumentation
frameworks/testing/runner/src/main/java/android/support/test/runner/MonitoringInstrumentation.java:410: error: cannot find symbol
private static class StubResultCallable implements Callable<ActivityResult> {
^
symbol: class ActivityResult
location: class MonitoringInstrumentation
frameworks/testing/runner/src/main/java/android/support/test/runner/MonitoringInstrumentation.java:418: error: cannot find symbol
public ActivityResult call() {
^
symbol: class ActivityResult
location: class StubResultCallable
frameworks/testing/runner/src/main/java/android/support/test/internal/runner/intent/IntentMonitorImpl.java:54: error: cannot find symbol
public void addIntentCallback(@NonNull IntentCallback callback) {
^
symbol: class NonNull
location: class IntentMonitorImpl
frameworks/testing/runner/src/main/java/android/support/test/internal/runner/intent/IntentMonitorImpl.java:77: error: cannot find symbol
public void removeIntentCallback(@NonNull IntentCallback callback) {
^
symbol: class NonNull
location: class IntentMonitorImpl
frameworks/testing/runner/src/main/java/android/support/test/runner/MonitoringInstrumentation.java:125: error: method registerInstance in class InstrumentationRegistry cannot be applied to given types;
InstrumentationRegistry.registerInstance(this, arguments);
^
required: Instrumentation,Bundle
found: MonitoringInstrumentation,Bundle
reason: actual argument MonitoringInstrumentation cannot be converted to Instrumentation by method invocation conversion
frameworks/testing/runner/src/main/java/android/support/test/runner/MonitoringInstrumentation.java:137: error: cannot find symbol
super.onCreate(arguments);
^
symbol: variable super
location: class MonitoringInstrumentation
frameworks/testing/runner/src/main/java/android/support/test/runner/MonitoringInstrumentation.java:120: error: method does not override or implement a method from a supertype
@override
^
frameworks/testing/runner/src/main/java/android/support/test/runner/MonitoringInstrumentation.java:148: error: cannot find symbol
File dexCache = getTargetContext().getDir("dxmaker_cache", Context.MODE_PRIVATE);
^
symbol: method getTargetContext()
location: class MonitoringInstrumentation
frameworks/testing/runner/src/main/java/android/support/test/runner/MonitoringInstrumentation.java:156: error: cannot find symbol
ClassLoader newClassLoader = this.getClass().getClassLoader();
^
symbol: method getClass()
frameworks/testing/runner/src/main/java/android/support/test/runner/MonitoringInstrumentation.java:186: error: cannot find symbol
super.onStart();
^
symbol: variable super
location: class MonitoringInstrumentation
frameworks/testing/runner/src/main/java/android/support/test/runner/MonitoringInstrumentation.java:204: error: cannot find symbol
waitForIdleSync();
^
symbol: method waitForIdleSync()
location: class MonitoringInstrumentation
frameworks/testing/runner/src/main/java/android/support/test/runner/MonitoringInstrumentation.java:184: error: method does not override or implement a method from a supertype
@override
^
frameworks/testing/runner/src/main/java/android/support/test/runner/MonitoringInstrumentation.java:232: error: cannot find symbol
super.finish(resultCode, results);
^
symbol: variable super
location: class MonitoringInstrumentation
frameworks/testing/runner/src/main/java/android/support/test/runner/MonitoringInstrumentation.java:216: error: method does not override or implement a method from a supertype
@override
^
frameworks/testing/runner/src/main/java/android/support/test/runner/MonitoringInstrumentation.java:272: error: cannot find symbol
super.onDestroy();
^
symbol: variable super
location: class MonitoringInstrumentation
frameworks/testing/runner/src/main/java/android/support/test/runner/MonitoringInstrumentation.java:268: error: method does not override or implement a method from a supertype
@override
^
frameworks/testing/runner/src/main/java/android/support/test/runner/MonitoringInstrumentation.java:278: error: cannot find symbol
super.callApplicationOnCreate(app);
^
symbol: variable super
location: class MonitoringInstrumentation
frameworks/testing/runner/src/main/java/android/support/test/runner/MonitoringInstrumentation.java:275: error: method does not override or implement a method from a supertype
@override
^
frameworks/testing/runner/src/main/java/android/support/test/runner/MonitoringInstrumentation.java:306: error: not an enclosing class: MonitoringInstrumentation
return MonitoringInstrumentation.super.startActivitySync( intent);
^
frameworks/testing/runner/src/main/java/android/support/test/runner/MonitoringInstrumentation.java:282: error: method does not override or implement a method from a supertype
@override
^
frameworks/testing/runner/src/main/java/android/support/test/runner/MonitoringInstrumentation.java:349: error: cannot find symbol
ActivityResult ar = stubResultFor(intent);
^
symbol: class ActivityResult
location: class MonitoringInstrumentation
frameworks/testing/runner/src/main/java/android/support/test/runner/MonitoringInstrumentation.java:354: error: cannot find symbol
return super.execStartActivity(who, contextThread, token, target, intent, requestCode);
^
symbol: variable super
location: class MonitoringInstrumentation
frameworks/testing/runner/src/main/java/android/support/test/runner/MonitoringInstrumentation.java:343: error: method does not override or implement a method from a supertype
@override
^
frameworks/testing/runner/src/main/java/android/support/test/runner/MonitoringInstrumentation.java:366: error: cannot find symbol
ActivityResult ar = stubResultFor(intent);
^
symbol: class ActivityResult
location: class MonitoringInstrumentation
frameworks/testing/runner/src/main/java/android/support/test/runner/MonitoringInstrumentation.java:371: error: cannot find symbol
return super.execStartActivity(who, contextThread, token, target, intent, requestCode, options);
^
symbol: variable super
location: class MonitoringInstrumentation
frameworks/testing/runner/src/main/java/android/support/test/runner/MonitoringInstrumentation.java:360: error: method does not override or implement a method from a supertype
@override
^
frameworks/testing/runner/src/main/java/android/support/test/runner/MonitoringInstrumentation.java:377: error: method does not override or implement a method from a supertype
@override
^
frameworks/testing/runner/src/main/java/android/support/test/runner/MonitoringInstrumentation.java:402: error: cannot find symbol
ActivityResult ar = stubResultFor(intent);
^
symbol: class ActivityResult
location: class MonitoringInstrumentation
frameworks/testing/runner/src/main/java/android/support/test/runner/MonitoringInstrumentation.java:407: error: cannot find symbol
return super.execStartActivity(who, contextThread, token, target, intent, requestCode, options);
^
symbol: variable super
location: class MonitoringInstrumentation
frameworks/testing/runner/src/main/java/android/support/test/runner/MonitoringInstrumentation.java:396: error: method does not override or implement a method from a supertype
@override
^
frameworks/testing/runner/src/main/java/android/support/test/runner/MonitoringInstrumentation.java:428: error: cannot find symbol
FutureTask<ActivityResult> task = new FutureTask<ActivityResult>(
^
symbol: class ActivityResult
location: class MonitoringInstrumentation
frameworks/testing/runner/src/main/java/android/support/test/runner/MonitoringInstrumentation.java:428: error: cannot find symbol
FutureTask<ActivityResult> task = new FutureTask<ActivityResult>(
^
symbol: class ActivityResult
location: class MonitoringInstrumentation
frameworks/testing/runner/src/main/java/android/support/test/runner/MonitoringInstrumentation.java:454: error: cannot find symbol
return super.onException(obj, e);
^
symbol: variable super
location: class MonitoringInstrumentation
frameworks/testing/runner/src/main/java/android/support/test/runner/MonitoringInstrumentation.java:447: error: method does not override or implement a method from a supertype
@override
^
frameworks/testing/runner/src/main/java/android/support/test/runner/MonitoringInstrumentation.java:481: error: cannot find symbol
super.callActivityOnDestroy(activity);
^
symbol: variable super
location: class MonitoringInstrumentation
frameworks/testing/runner/src/main/java/android/support/test/runner/MonitoringInstrumentation.java:479: error: method does not override or implement a method from a supertype
@override
^
frameworks/testing/runner/src/main/java/android/support/test/runner/MonitoringInstrumentation.java:487: error: cannot find symbol
super.callActivityOnRestart(activity);
^
symbol: variable super
location: class MonitoringInstrumentation
frameworks/testing/runner/src/main/java/android/support/test/runner/MonitoringInstrumentation.java:485: error: method does not override or implement a method from a supertype
@override
^
frameworks/testing/runner/src/main/java/android/support/test/runner/MonitoringInstrumentation.java:494: error: cannot find symbol
super.callActivityOnCreate(activity, bundle);
^
symbol: variable super
location: class MonitoringInstrumentation
frameworks/testing/runner/src/main/java/android/support/test/runner/MonitoringInstrumentation.java:491: error: method does not override or implement a method from a supertype
@override
^
frameworks/testing/runner/src/main/java/android/support/test/runner/MonitoringInstrumentation.java:506: error: cannot find symbol
super.callActivityOnStart(activity);
^
symbol: variable super
location: class MonitoringInstrumentation
frameworks/testing/runner/src/main/java/android/support/test/runner/MonitoringInstrumentation.java:502: error: method does not override or implement a method from a supertype
@override
^
frameworks/testing/runner/src/main/java/android/support/test/runner/MonitoringInstrumentation.java:517: error: cannot find symbol
super.callActivityOnStop(activity);
^
symbol: variable super
location: class MonitoringInstrumentation
frameworks/testing/runner/src/main/java/android/support/test/runner/MonitoringInstrumentation.java:514: error: method does not override or implement a method from a supertype
@override
^
frameworks/testing/runner/src/main/java/android/support/test/runner/MonitoringInstrumentation.java:526: error: cannot find symbol
super.callActivityOnResume(activity);
^
symbol: variable super
location: class MonitoringInstrumentation
frameworks/testing/runner/src/main/java/android/support/test/runner/MonitoringInstrumentation.java:524: error: method does not override or implement a method from a supertype
@override
^
frameworks/testing/runner/src/main/java/android/support/test/runner/MonitoringInstrumentation.java:532: error: cannot find symbol
super.callActivityOnPause(activity);
^
symbol: variable super
location: class MonitoringInstrumentation
frameworks/testing/runner/src/main/java/android/support/test/runner/MonitoringInstrumentation.java:530: error: method does not override or implement a method from a supertype
@override
^
frameworks/testing/runner/src/main/java/android/support/test/runner/MonitoringInstrumentation.java:563: error: cannot find symbol
return super.newActivity(clazz,
^
symbol: variable super
location: class MonitoringInstrumentation
frameworks/testing/runner/src/main/java/android/support/test/runner/MonitoringInstrumentation.java:542: error: method does not override or implement a method from a supertype
@override
^
frameworks/testing/runner/src/main/java/android/support/test/runner/AndroidJUnitRunner.java:189: error: method fromManifest in class Builder cannot be applied to given types;
.fromManifest(this)
^
required: Instrumentation
found: AndroidJUnitRunner
reason: actual argument AndroidJUnitRunner cannot be converted to Instrumentation by method invocation conversion
frameworks/testing/runner/src/main/java/android/support/test/runner/AndroidJUnitRunner.java:196: error: cannot find symbol
start();
^
symbol: method start()
location: class AndroidJUnitRunner
frameworks/testing/runner/src/main/java/android/support/test/runner/AndroidJUnitRunner.java:219: error: constructor Builder in class Builder cannot be applied to given types;
TestExecutor.Builder executorBuilder = new TestExecutor.Builder(this);
^
required: Instrumentation
found: AndroidJUnitRunner
reason: actual argument AndroidJUnitRunner cannot be converted to Instrumentation by method invocation conversion
frameworks/testing/runner/src/main/java/android/support/test/runner/AndroidJUnitRunner.java:258: error: constructor ActivityFinisherRunListener in class ActivityFinisherRunListener cannot be applied to given types;
builder.addRunListener(new ActivityFinisherRunListener(this,
^
required: Instrumentation,MonitoringInstrumentation.Activity Finisher
found: AndroidJUnitRunner,MonitoringInstrumentation.Activ ityFinisher
reason: actual argument AndroidJUnitRunner cannot be converted to Instrumentation by method invocation conversion
frameworks/testing/runner/src/main/java/android/support/test/runner/AndroidJUnitRunner.java:309: error: method createTestRequestBuilder in class AndroidJUnitRunner cannot be applied to given types;
TestRequestBuilder builder = createTestRequestBuilder(this, bundleArgs);
^
required: Instrumentation,Bundle
found: AndroidJUnitRunner,Bundle
reason: actual argument AndroidJUnitRunner cannot be converted to Instrumentation by method invocation conversion
frameworks/testing/runner/src/main/java/android/support/test/runner/AndroidJUnitRunner.java:314: error: cannot find symbol
builder.addApkToScan(getContext().getPackageCodePa th());
^
symbol: method getContext()
location: class AndroidJUnitRunner
frameworks/testing/runner/src/main/java/android/support/test/runner/AndroidJUnitRunner.java:319: error: cannot find symbol
if (null != getTargetContext()) {
^
symbol: method getTargetContext()
location: class AndroidJUnitRunner
frameworks/testing/runner/src/main/java/android/support/test/runner/AndroidJUnitRunner.java:321: error: cannot find symbol
getTargetContext()).buildIfPossible();
^
symbol: method getTargetContext()
location: class AndroidJUnitRunner
Note: frameworks/testing/runner/src/main/java/android/support/test/internal/runner/junit4/AndroidJUnit4ClassRunner.java uses or overrides a deprecated API.
Note: Recompile with -Xlint:deprecation for details.
Note: Some input files use unchecked or unsafe operations.
Note: Recompile with -Xlint:unchecked for details.
67 errors

make: *** [/home/raghav/source/cm/system/out/target/common/obj/JAVA_LIBRARIES/android-support-test-src_intermediates/classes-full-debug.jar] Error 41
make: *** Waiting for unfinished jobs....
/home/raghav/source/cm/system/kernel/samsung/i9082/Makefile:1414: warning: overriding commands for target `clean'
/home/raghav/source/cm/system/kernel/samsung/i9082/Makefile:1180: warning: ignoring old commands for target `clean'
GEN /home/raghav/source/cm/system/out/target/product/i9082/obj/KERNEL_OBJ/Makefile
scripts/kconfig/conf --silentoldconfig Kconfig
arch/arm/mach-capri/custom_boards/Kconfig:19:warning: defaults for choice values not supported
arch/arm/mach-capri/custom_boards/Kconfig:25:warning: defaults for choice values not supported
arch/arm/mach-capri/custom_boards/Kconfig:31:warning: defaults for choice values not supported
arch/arm/mach-capri/custom_boards/Kconfig:37:warning: defaults for choice values not supported
/home/raghav/source/cm/system/kernel/samsung/i9082/Makefile:1414: warning: overriding commands for target `clean'
/home/raghav/source/cm/system/kernel/samsung/i9082/Makefile:1180: warning: ignoring old commands for target `clean'
GEN /home/raghav/source/cm/system/out/target/product/i9082/obj/KERNEL_OBJ/Makefile
CHK include/linux/version.h
CHK include/generated/utsrelease.h
Using /home/raghav/source/cm/system/kernel/samsung/i9082 as source for kernel
make[3]: `include/generated/mach-types.h' is up to date.
CALL /home/raghav/source/cm/system/kernel/samsung/i9082/scripts/checksyscalls.sh
CHK include/generated/compile.h
GZIP kernel/config_data.gz
IKCFG kernel/config_data.h
CC kernel/configs.o
LD kernel/built-in.o
++++++++++++++++++++++
CONFIG_ISP = n
obj = drivers/char/broadcom/isp
++++++++++++++++++++++
CONFIG_UNICAM = n
obj = drivers/char/broadcom/unicam
++++++++++++++++++++++
CONFIG_V3D = n
obj = drivers/char/broadcom/v3d
++++++++++++++++++++++
CONFIG_VCE = n
obj = drivers/char/broadcom/vce
VCHIQ_PLATFORM_CONFIG = capri-bi
Building for MAP build system
CONFIG_ARCH_KONA = y
echo "(new) Generating drivers/misc/vc04_services/interface/vchiq_arm/vchiq_version.c ..."
(new) Generating drivers/misc/vc04_services/interface/vchiq_arm/vchiq_version.c ...
perl /home/raghav/source/cm/system/kernel/samsung/i9082/drivers/misc/vc04_services/interface/vchiq_arm/vchiq_genversion vchiq /home/raghav/source/cm/system/kernel/samsung/i9082 > drivers/misc/vc04_services/interface/vchiq_arm/vchiq_version.c
Version cad4731a5459c8d522881166c8315b9e3418c687 (tainted)
CC drivers/misc/vc04_services/interface/vchiq_arm/vchiq_version.o
LD drivers/misc/vc04_services/vc-vchiq.o
LD drivers/misc/vc04_services/vc-vchiq-memdrv-kona.o
LD drivers/misc/vc04_services/built-in.o
LD drivers/misc/built-in.o
LD drivers/built-in.o
LD vmlinux.o
MODPOST vmlinux.o
WARNING: modpost: Found 4 section mismatch(es).
To see full details build your kernel with:
'make CONFIG_DEBUG_SECTION_MISMATCH=y'
GEN .version
CHK include/generated/compile.h
UPD include/generated/compile.h
CC init/version.o
LD init/built-in.o
LD .tmp_vmlinux1
KSYM .tmp_kallsyms1.S
AS .tmp_kallsyms1.o
LD .tmp_vmlinux2
KSYM .tmp_kallsyms2.S
AS .tmp_kallsyms2.o
LD vmlinux
SYSMAP System.map
SYSMAP .tmp_System.map
OBJCOPY arch/arm/boot/Image
Kernel: arch/arm/boot/Image is ready
GZIP arch/arm/boot/compressed/piggy.gzip
SHIPPED arch/arm/boot/compressed/lib1funcs.S
SHIPPED arch/arm/boot/compressed/longlong.h
AS arch/arm/boot/compressed/lib1funcs.o
SHIPPED arch/arm/boot/compressed/divdi3.c
CC arch/arm/boot/compressed/divdi3.o
AS arch/arm/boot/compressed/piggy.gzip.o
LD arch/arm/boot/compressed/vmlinux
OBJCOPY arch/arm/boot/zImage
Kernel: arch/arm/boot/zImage is ready
make[1]: Leaving directory `/home/raghav/source/cm/system/kernel/samsung/i9082'
make -C kernel/samsung/i9082 O=/home/raghav/source/cm/system/out/target/product/i9082/obj/KERNEL_OBJ ARCH=arm CROSS_COMPILE="/home/raghav/source/cm/system/prebuilts/misc/linux-x86/ccache/ccache arm-eabi-" dtbs
make[1]: Entering directory `/home/raghav/source/cm/system/kernel/samsung/i9082'
/home/raghav/source/cm/system/kernel/samsung/i9082/Makefile:1414: warning: overriding commands for target `clean'
/home/raghav/source/cm/system/kernel/samsung/i9082/Makefile:1180: warning: ignoring old commands for target `clean'
make[3]: Nothing to be done for `arch/arm/boot/dtbs'.
make[1]: Leaving directory `/home/raghav/source/cm/system/kernel/samsung/i9082'
make -C kernel/samsung/i9082 O=/home/raghav/source/cm/system/out/target/product/i9082/obj/KERNEL_OBJ ARCH=arm CROSS_COMPILE="/home/raghav/source/cm/system/prebuilts/misc/linux-x86/ccache/ccache arm-eabi-" modules
make[1]: Entering directory `/home/raghav/source/cm/system/kernel/samsung/i9082'
/home/raghav/source/cm/system/kernel/samsung/i9082/Makefile:1414: warning: overriding commands for target `clean'
/home/raghav/source/cm/system/kernel/samsung/i9082/Makefile:1180: warning: ignoring old commands for target `clean'
GEN /home/raghav/source/cm/system/out/target/product/i9082/obj/KERNEL_OBJ/Makefile
CHK include/linux/version.h
++++++++++++++++++++++
CONFIG_ISP = n
obj = drivers/char/broadcom/isp
Using /home/raghav/source/cm/system/kernel/samsung/i9082 as source for kernel
++++++++++++++++++++++
CONFIG_UNICAM = n
obj = drivers/char/broadcom/unicam
++++++++++++++++++++++
CONFIG_V3D = n
obj = drivers/char/broadcom/v3d
CHK include/generated/utsrelease.h
++++++++++++++++++++++
CONFIG_VCE = n
obj = drivers/char/broadcom/vce
make[3]: `include/generated/mach-types.h' is up to date.
VCHIQ_PLATFORM_CONFIG = capri-bi
Building for MAP build system
CONFIG_ARCH_KONA = y
CALL /home/raghav/source/cm/system/kernel/samsung/i9082/scripts/checksyscalls.sh
++++++++++++++++++++++
CONFIG_ISP = n
obj = drivers/char/broadcom/isp
++++++++++++++++++++++
CONFIG_UNICAM = n
obj = drivers/char/broadcom/unicam
++++++++++++++++++++++
CONFIG_V3D = n
obj = drivers/char/broadcom/v3d
++++++++++++++++++++++
CONFIG_VCE = n
obj = drivers/char/broadcom/vce
VCHIQ_PLATFORM_CONFIG = capri-bi
Building for MAP build system
CONFIG_ARCH_KONA = y
Building modules, stage 2.
MODPOST 6 modules
make[1]: Leaving directory `/home/raghav/source/cm/system/kernel/samsung/i9082'
make -C kernel/samsung/i9082 O=/home/raghav/source/cm/system/out/target/product/i9082/obj/KERNEL_OBJ INSTALL_MOD_PATH=../../system ARCH=arm CROSS_COMPILE="/home/raghav/source/cm/system/prebuilts/misc/linux-x86/ccache/ccache arm-eabi-" modules_install
make[1]: Entering directory `/home/raghav/source/cm/system/kernel/samsung/i9082'
/home/raghav/source/cm/system/kernel/samsung/i9082/Makefile:1414: warning: overriding commands for target `clean'
/home/raghav/source/cm/system/kernel/samsung/i9082/Makefile:1180: warning: ignoring old commands for target `clean'
INSTALL crypto/md4.ko
INSTALL drivers/char/broadcom/gist.ko
INSTALL drivers/char/broadcom/sigmorph.ko
INSTALL drivers/net/wireless/bcmdhd/dhd.ko
INSTALL drivers/scsi/scsi_wait_scan.ko
INSTALL fs/cifs/cifs.ko
DEPMOD 3.0.101+
Warning: you may need to install module-init-tools
See http://www.codemonkey.org.uk/docs/po...loween-2.6.txt
make[1]: Leaving directory `/home/raghav/source/cm/system/kernel/samsung/i9082'
mdpath=`find /home/raghav/source/cm/system/out/target/product/i9082/system/lib/modules -type f -name modules.order`; if [ "$mdpath" != "" ];then mpath=`dirname $mdpath`; ko=`find $mpath/kernel -type f -name *.ko`; for i in $ko; do arm-eabi-strip --strip-unneeded $i; mv $i /home/raghav/source/cm/system/out/target/product/i9082/system/lib/modules/; done; fi
mdpath=`find /home/raghav/source/cm/system/out/target/product/i9082/system/lib/modules -type f -name modules.order`; if [ "$mdpath" != "" ];then mpath=`dirname $mdpath`; rm -rf $mpath; fi

#### make failed to build some targets (14:12 (mm:ss)) ####

Can someone please help me resolve this issue? This problem is giving me a headache :(

Also what does this mean?
"ebtables is disabled on this build"

Thanks in Advance



mercredi 16 septembre 2015

Smart Dock 2 Doesn't work



I've used the dock from my Note 2 with my Note 3 and Note 4 to project onto my TV.

This accessory no longer works with the 5.

Is there a third party mirroring dock?

And yes I also use a chromecast but I prefer to be connected directly rather than via Wi-Fi



Can't mount /system, Odin doesn't recognize phone



Hope you guys can help me, I ran outta ideas. Here's my problem: I was on a cm12s based rom, downloaded latest SlimRom and when I was installing (using twrp recovery) it gave me an error: "Unable to mount /system". I read some stuff on different websites and ended up trying with another rom and other Recovery's (philz and cwm) but none of that helped. After that I downloaded stock rom to install via Odin but Odin doesn't recognize my phone, I installed Samsung USB drivers, installed kies, tried with different usb cables, tried with different computers but Odin simply doesn't recognize it, now my phone is stuck at download mode since I don't have os installed, is there any way to fix unable to mount system problem? Or to make Odin recognize my phone? I would really appreciate your help.



mardi 15 septembre 2015

adb works but fastboot doesnt



I was able to use the asus v7 unlock tool successfully, and now am at the "The fun begins" step of http://forum.xda-developers.com/tran...tf300-t3061648[Beginners Guide]

it seems my adb works but fastboot doesnt?

c:\adb>adb devices
List of devices attached
C4OKCT035589 device


c:\adb>fastboot devices

c:\adb>

seems odd.



lundi 14 septembre 2015

Switching off on its own - the phone doesn't work again after stand by



Hi together

I have the following problem:
When the phone goes to standby-mode, after about 1 minute in standby mode, the phone switch off of its own, i habe tried all the Rom's, now i have installed Eragon 2.5, and the problem is still there :eek:

thanks for helping

Dani



Fingerprint doesn`t work after root



Fingerprint doesn`t work after root and install googy max kernel 5.1.1



my phone doesn't work



Hi.I have a problem with my Huawei u8815.I made a reset factory,but after that when i try to configure language,network,time and date y receive the message "Unfortunately,Setup Wizard has stopped".I try once more to reset but still same problem.I know i have to reinstall firmwaire but i don't know how to do,and download.PLEASE I NEED YOUR HELP.



Reactivation lock doesn't get turn off need help



I'm having issue with my note 4 N910C ,I need to root my phone for root or flashing twrp recovery reactivation lock must be untick when I try to untick it doesn't get turn off I also flash the stock rom after flashing a rom, I can't turn off the reactivation lock of my phone. I uncheck it, but when I enter download or recovery mode, it is still turned on and this doesn't link to any samsung id account but show activation lock on in download mode even I flash stock rom and done hard format but still got this issue
help would be appreciated

Thanks an advance



[Q] Doesn't always fast charge?



Does anyone else have an issue with fast charging? I am using the original cable/charger that came in the box and I have to unplug/replug it in anywhere from 2-6 times for it to register as fast charging, sometimes more. I have also tried using the charger that came with my Note 4, same issue. Tried using a different wall outlet, same issue. I noticed a thread on Android Central references this same issue but as that is not purely T-Mobile brands, it's hard to gauge where the issue comes from.

Anyone else experiencing this?



samedi 12 septembre 2015

Can you put nfc on a phone that doesn't have it?



Hey guys, I was looking to get a new phone, and the ONLY thing holding me back is the fact that it does not have nfc built in. This is real dealbreaker for me, as nfc is a huge part of my life. I was wondering if there was a way to nfc enable a phone that doesn't have nfc built in. If someone knows of a way, please let me know. Also, I can easily get nfc tags that aren't affected by battery radio interference, but I haven't found a way to use this for file transfer and android beam.

I know a thread like this was created in 2012, to no avail, but I was hoping times have changed, as nfc is becoming more and more popular these days.


Thanks in advance to anyone that helps me!!!



vendredi 11 septembre 2015

Phone doesn't vibrate when on vibrate only mode.



So, when I set my phone to VIBRATE mode, it doesn't vibrate at all. Anyone else experiencing this or have any advice? Thanks.



CMW Doesnt Recognize /sdcard



Yeah... I've install rom called "Android L by Duca" and it replaces original recover to cmw by broadcm
i mounted da sd in da phone but doesnt recognize when da mejistic phone in recovery mode